{"text_format":"1","workbook":"xlsx","n_sheets":4,"sheets":["RCA Chart Audit Worksheet","Graphs","Data","Pivot Tables"],"not_rendered":{"charts":2,"images":1,"macros":1,"external_links":0,"defined_names":0,"comments":0,"pivot_tables":2},"unopened":[],"bounds":{"document_bytes":16777216,"sheet_cells":100000,"rows_first":2000,"rows_last":500,"rows_between":2000,"halvings":0,"cell_chars":16384,"cell_head_chars":4096},"cells_cut":0,"cells_raw":0,"read":"whole","date_system":"1900"}

{"sheet":"RCA Chart Audit Worksheet","index":0,"n_rows":54,"n_cols":39,"rows_kept":54,"cut":false,"hidden":false,"merged":[[0,0,1,2],[1,13,1,17],[1,18,1,27],[1,28,1,34],[0,13,0,34],[0,4,1,12]]}
["Review Information",null,null,null,"Readmission Information",null,null,null,null,null,null,null,null,"Hospital Readmission Drivers"]
[null,null,null,null,null,null,null,null,null,null,null,null,null,"Referral Information Incomplete or Inaccurate",null,null,null,null,"Agency-based Issues",null,null,null,null,null,null,null,null,null,"Family Issues"]
["Readmission Chart Review ","Reviewer's Name","Date of Review","Month of Review","HHA Admission Date","Hospital Discharge Date","Hospital Readmission Date","Number of Days Before Readmission (1–7) ","Resident's Name (First Initial, Last Name) ","Name of Physician Overseeing Home Health Care (HHC) ","What Day of the Week Did the Readmission Occur?","Name of Discharging/ Referring Hospital","Symptoms That Resulted in Rehospitalization","Lacking a Listed Primary Care Physician (PCP)","No Caregiver or Overwhelmed Caregiver","Medication List Missing or Inaccurate ","Prescribed Durable Medical Equipment (DME)/Supplies Not in Home","Agency Did Not Receive Orders for New Medications","On-call Physician Referred Patient to ED","Change in Condition Not Detected Soon Enough/ Stop and Watch","Clinical Team Did Not Follow Best Practice/Clinical Pathway  ","Clinician Did Not Use Situation-Background- Assessment- Recommendation (SBAR) to Communicate Effectively to Physician","Patient Not Seen by PCP or Other Provider Prior to Readmission","Exacerbation of Co-Morbid Diagnosis","Post Operative Complication (wound healing, infection, sepsis) ","Mental/Behavioral Health Issues Were Not Addressed","Unclear Advance Directives/ Hospice","Agency Unable to Comply With a Schedule to Meet the Patient's Needs.","Patient/Family Refused Hospice Care","Patient/Family Did Not Understand Plan of Care   ","Patient/Family Called 911/Did Not Call Home Health Agency (HHA)","Refused Skilled Nursing Facility (SNF) Placement Post Hospital Discharge","Unable to Obtain or Afford Prescribed Medications","Medication Related Event ","Did Not Make Physician/Licensed Independent Practitioner Follow-Up Visit","Primary Reason for Readmission","Referral information incomplete or inaccurate","Agency based Issues","Family issues"]
["Chart #1","XXXXX","2018-05-28",{"$f":"IF(Table2[[#This Row],[Hospital Readmission Date]]=\"\",\"\",TEXT(Table2[[#This Row],[Hospital Readmission Date]],\"mmmm\"))","v":"June"},"2018-05-24","2018-05-26","2018-06-02",{"$f":"IF(Table2[[#This Row],[Hospital Readmission Date]]=\"\",\"\",IF(Table2[[#This Row],[Hospital Readmission Date]]-Table2[[#This Row],[Hospital Discharge Date]]>7,\"8+\",Table2[[#This Row],[Hospital Readmission Date]]-Table2[[#This Row],[Hospital Discharge Date]]))","v":7},"XXXXX","XXXXX",{"$f":"IF(Table2[[#This Row],[Hospital Readmission Date]]=\"\",\"\",TEXT(Table2[[#This Row],[Hospital Readmission Date]],\"dddd\"))","v":"Saturday"},"XXXXX",null,"yes","no","no","no","no","no","no","no","no","no","no","no","no","no","no","no","no","no","no","no","no","no",{"$f":"IF(Table2[[#This Row],[Date of Review]]=\"\",\"\",IF(Data!AD2=1,IF(SUM(Data!AE2:AF2)>0,\"Multiple Reasons\",Data!AD$1),IF(Data!AE2=1,IF(Data!AD2+Data!AF2>0,\"Multiple Reasons\",Data!AE$1),IF(Data!AF2=1,IF(SUM(Data!AD2:AE2)>0,\"Multiple Reasons\",Data!AF$1),\"No Reason\"))))","v":"Referral information incomplete or inaccurate"},{"$f":"Data!Z2","v":1},{"$f":"Data!AA2","v":0},{"$f":"Data!AB2","v":0}]
["Chart #2","XXXXX","2018-05-18",{"$f":"IF(Table2[[#This Row],[Hospital Readmission Date]]=\"\",\"\",TEXT(Table2[[#This Row],[Hospital Readmission Date]],\"mmmm\"))","v":"June"},"2018-05-24","2018-05-26","2018-06-02",{"$f":"IF(Table2[[#This Row],[Hospital Readmission Date]]=\"\",\"\",IF(Table2[[#This Row],[Hospital Readmission Date]]-Table2[[#This Row],[Hospital Discharge Date]]>7,\"8+\",Table2[[#This Row],[Hospital Readmission Date]]-Table2[[#This Row],[Hospital Discharge Date]]))","v":7},"XXXXX","XXXXX",{"$f":"IF(Table2[[#This Row],[Hospital Readmission Date]]=\"\",\"\",TEXT(Table2[[#This Row],[Hospital Readmission Date]],\"dddd\"))","v":"Saturday"},"XXXXX",null,"no","no","no","no","no","yes","no","no","no","no","no","no","no","no","no","no","no","no","no","no","no","no",{"$f":"IF(Table2[[#This Row],[Date of Review]]=\"\",\"\",IF(Data!AD3=1,IF(SUM(Data!AE3:AF3)>0,\"Multiple Reasons\",Data!AD$1),IF(Data!AE3=1,IF(Data!AD3+Data!AF3>0,\"Multiple Reasons\",Data!AE$1),IF(Data!AF3=1,IF(SUM(Data!AD3:AE3)>0,\"Multiple Reasons\",Data!AF$1),\"No Reason\"))))","v":"Agency based Issues"},{"$f":"Data!Z3","v":0},{"$f":"Data!AA3","v":1},{"$f":"Data!AB3","v":0}]
["Chart #3","XXXXX","2018-05-27",{"$f":"IF(Table2[[#This Row],[Hospital Readmission Date]]=\"\",\"\",TEXT(Table2[[#This Row],[Hospital Readmission Date]],\"mmmm\"))","v":"May"},"2018-05-24","2018-05-26","2018-05-31",{"$f":"IF(Table2[[#This Row],[Hospital Readmission Date]]=\"\",\"\",IF(Table2[[#This Row],[Hospital Readmission Date]]-Table2[[#This Row],[Hospital Discharge Date]]>7,\"8+\",Table2[[#This Row],[Hospital Readmission Date]]-Table2[[#This Row],[Hospital Discharge Date]]))","v":5},"XXXXX","XXXXX",{"$f":"IF(Table2[[#This Row],[Hospital Readmission Date]]=\"\",\"\",TEXT(Table2[[#This Row],[Hospital Readmission Date]],\"dddd\"))","v":"Thursday"},"XXXXX",null,"no","no","no","no","no","no","no","no","no","no","no","no","no","no","no","yes","no","no","no","no","no","no",{"$f":"IF(Table2[[#This Row],[Date of Review]]=\"\",\"\",IF(Data!AD4=1,IF(SUM(Data!AE4:AF4)>0,\"Multiple Reasons\",Data!AD$1),IF(Data!AE4=1,IF(Data!AD4+Data!AF4>0,\"Multiple Reasons\",Data!AE$1),IF(Data!AF4=1,IF(SUM(Data!AD4:AE4)>0,\"Multiple Reasons\",Data!AF$1),\"No Reason\"))))","v":"Family issues"},{"$f":"Data!Z4","v":0},{"$f":"Data!AA4","v":0},{"$f":"Data!AB4","v":1}]
["Chart #4","XXXXX","2018-05-27",{"$f":"IF(Table2[[#This Row],[Hospital Readmission Date]]=\"\",\"\",TEXT(Table2[[#This Row],[Hospital Readmission Date]],\"mmmm\"))","v":"June"},"2018-05-24","2018-05-26","2018-06-02",{"$f":"IF(Table2[[#This Row],[Hospital Readmission Date]]=\"\",\"\",IF(Table2[[#This Row],[Hospital Readmission Date]]-Table2[[#This Row],[Hospital Discharge Date]]>7,\"8+\",Table2[[#This Row],[Hospital Readmission Date]]-Table2[[#This Row],[Hospital Discharge Date]]))","v":7},"XXXXX","XXXXX",{"$f":"IF(Table2[[#This Row],[Hospital Readmission Date]]=\"\",\"\",TEXT(Table2[[#This Row],[Hospital Readmission Date]],\"dddd\"))","v":"Saturday"},"XXXXX",null,"yes","no","no","no","no","yes","no","no","no","no","no","no","no","no","no","no","no","no","no","no","no","no",{"$f":"IF(Table2[[#This Row],[Date of Review]]=\"\",\"\",IF(Data!AD5=1,IF(SUM(Data!AE5:AF5)>0,\"Multiple Reasons\",Data!AD$1),IF(Data!AE5=1,IF(Data!AD5+Data!AF5>0,\"Multiple Reasons\",Data!AE$1),IF(Data!AF5=1,IF(SUM(Data!AD5:AE5)>0,\"Multiple Reasons\",Data!AF$1),\"No Reason\"))))","v":"Multiple Reasons"},{"$f":"Data!Z5","v":1},{"$f":"Data!AA5","v":1},{"$f":"Data!AB5","v":0}]
["Chart #5","XXXXX","2018-05-27",{"$f":"IF(Table2[[#This Row],[Hospital Readmission Date]]=\"\",\"\",TEXT(Table2[[#This Row],[Hospital Readmission Date]],\"mmmm\"))","v":"June"},"2018-05-24","2018-05-26","2018-06-02",{"$f":"IF(Table2[[#This Row],[Hospital Readmission Date]]=\"\",\"\",IF(Table2[[#This Row],[Hospital Readmission Date]]-Table2[[#This Row],[Hospital Discharge Date]]>7,\"8+\",Table2[[#This Row],[Hospital Readmission Date]]-Table2[[#This Row],[Hospital Discharge Date]]))","v":7},"XXXXX","XXXXX",{"$f":"IF(Table2[[#This Row],[Hospital Readmission Date]]=\"\",\"\",TEXT(Table2[[#This Row],[Hospital Readmission Date]],\"dddd\"))","v":"Saturday"},"XXXXX",null,"no","no","no","no","no","no","no","no","no","no","no","no","no","no","no","no","no","no","no","no","no","no",{"$f":"IF(Table2[[#This Row],[Date of Review]]=\"\",\"\",IF(Data!AD6=1,IF(SUM(Data!AE6:AF6)>0,\"Multiple Reasons\",Data!AD$1),IF(Data!AE6=1,IF(Data!AD6+Data!AF6>0,\"Multiple Reasons\",Data!AE$1),IF(Data!AF6=1,IF(SUM(Data!AD6:AE6)>0,\"Multiple Reasons\",Data!AF$1),\"No Reason\"))))","v":"No Reason"},{"$f":"Data!Z6","v":0},{"$f":"Data!AA6","v":0},{"$f":"Data!AB6","v":0}]
{"$rows_left_out":47}
{"sheet":"Graphs","index":1,"n_rows":0,"n_cols":0,"rows_kept":0,"cut":false,"hidden":false,"merged":[]}

{"sheet":"Data","index":2,"n_rows":53,"n_cols":32,"rows_kept":53,"cut":false,"hidden":true,"merged":[]}
["yes",null,"Lacking a listed PCP","No Caregiver or overwhelmed Caregiver","Medication list missing or inaccurate ","Prescribed DME / Supplies not in home","Agency did not receive orders for new medications","On-call physician referred patient to ED","Change in condition not detected soon enough/ Stop and Watch","Clinical team did not follow best practice/clinical pathway  ","Clinician did not use SBAR to communicate effectively to physician","Patient not seen by PCP or other provider prior to readmission","Exacerbation of co-morbid diagnosis","Post Op complication (wound healing, infection, sepsis) ","Mental/Behavioral Health issues were not addressed","Unclear Advance directives/hospice","Agency unable to comply with a schedule to meet the patient's needs.","Patient/family refused Hospice care","Patient/family did not understand plan of care   ","Patient /family called 911 / did not call HHA","Refused SNF placement post hospital discharge","Unable to obtain or afford prescribed medications","Medication related event ","Did not make physician/liscensed independent practitioner follow-up visit",null,"Referral information incomplete or inaccurate","Agency based Issues","Family issues",null,"Referral information incomplete or inaccurate","Agency based Issues","Family issues"]
["no",null,{"$f":"IF('RCA Chart Audit Worksheet'!N4=\"Yes\",1,0)","v":1},{"$f":"IF('RCA Chart Audit Worksheet'!O4=\"Yes\",1,0)","v":0},{"$f":"IF('RCA Chart Audit Worksheet'!P4=\"Yes\",1,0)","v":0},{"$f":"IF('RCA Chart Audit Worksheet'!Q4=\"Yes\",1,0)","v":0},{"$f":"IF('RCA Chart Audit Worksheet'!R4=\"Yes\",1,0)","v":0},{"$f":"IF('RCA Chart Audit Worksheet'!S4=\"Yes\",1,0)","v":0},{"$f":"IF('RCA Chart Audit Worksheet'!T4=\"Yes\",1,0)","v":0},{"$f":"IF('RCA Chart Audit Worksheet'!U4=\"Yes\",1,0)","v":0},{"$f":"IF('RCA Chart Audit Worksheet'!V4=\"Yes\",1,0)","v":0},{"$f":"IF('RCA Chart Audit Worksheet'!W4=\"Yes\",1,0)","v":0},{"$f":"IF('RCA Chart Audit Worksheet'!X4=\"Yes\",1,0)","v":0},{"$f":"IF('RCA Chart Audit Worksheet'!Y4=\"Yes\",1,0)","v":0},{"$f":"IF('RCA Chart Audit Worksheet'!Z4=\"Yes\",1,0)","v":0},{"$f":"IF('RCA Chart Audit Worksheet'!AA4=\"Yes\",1,0)","v":0},{"$f":"IF('RCA Chart Audit Worksheet'!AB4=\"Yes\",1,0)","v":0},{"$f":"IF('RCA Chart Audit Worksheet'!AC4=\"Yes\",1,0)","v":0},{"$f":"IF('RCA Chart Audit Worksheet'!AD4=\"Yes\",1,0)","v":0},{"$f":"IF('RCA Chart Audit Worksheet'!AE4=\"Yes\",1,0)","v":0},{"$f":"IF('RCA Chart Audit Worksheet'!AF4=\"Yes\",1,0)","v":0},{"$f":"IF('RCA Chart Audit Worksheet'!AG4=\"Yes\",1,0)","v":0},{"$f":"IF('RCA Chart Audit Worksheet'!AH4=\"Yes\",1,0)","v":0},{"$f":"IF('RCA Chart Audit Worksheet'!AI4=\"Yes\",1,0)","v":0},null,{"$f":"SUM(C2:G2)","v":1},{"$f":"SUM(H2:Q2)","v":0},{"$f":"SUM(R2:X2)","v":0},null,{"$f":"IF(SUM(Z2:AB2)=0,0,IF(Z2>=AA2,IF(Z2>=AB2,1,0),0))","v":1},{"$f":"IF(SUM(Z2:AB2)=0,0,IF(AA2>=Z2,IF(AA2>=AB2,1,0),0))","v":0},{"$f":"IF(SUM(Z2:AB2)=0,0,IF(AB2>=Z2,IF(AB2>=AA2,1,0),0))","v":0}]
[null,null,{"$f":"IF('RCA Chart Audit Worksheet'!N5=\"Yes\",1,0)","v":0},{"$f":"IF('RCA Chart Audit Worksheet'!O5=\"Yes\",1,0)","v":0},{"$f":"IF('RCA Chart Audit Worksheet'!P5=\"Yes\",1,0)","v":0},{"$f":"IF('RCA Chart Audit Worksheet'!Q5=\"Yes\",1,0)","v":0},{"$f":"IF('RCA Chart Audit Worksheet'!R5=\"Yes\",1,0)","v":0},{"$f":"IF('RCA Chart Audit Worksheet'!S5=\"Yes\",1,0)","v":1},{"$f":"IF('RCA Chart Audit Worksheet'!T5=\"Yes\",1,0)","v":0},{"$f":"IF('RCA Chart Audit Worksheet'!U5=\"Yes\",1,0)","v":0},{"$f":"IF('RCA Chart Audit Worksheet'!V5=\"Yes\",1,0)","v":0},{"$f":"IF('RCA Chart Audit Worksheet'!W5=\"Yes\",1,0)","v":0},{"$f":"IF('RCA Chart Audit Worksheet'!X5=\"Yes\",1,0)","v":0},{"$f":"IF('RCA Chart Audit Worksheet'!Y5=\"Yes\",1,0)","v":0},{"$f":"IF('RCA Chart Audit Worksheet'!Z5=\"Yes\",1,0)","v":0},{"$f":"IF('RCA Chart Audit Worksheet'!AA5=\"Yes\",1,0)","v":0},{"$f":"IF('RCA Chart Audit Worksheet'!AB5=\"Yes\",1,0)","v":0},{"$f":"IF('RCA Chart Audit Worksheet'!AC5=\"Yes\",1,0)","v":0},{"$f":"IF('RCA Chart Audit Worksheet'!AD5=\"Yes\",1,0)","v":0},{"$f":"IF('RCA Chart Audit Worksheet'!AE5=\"Yes\",1,0)","v":0},{"$f":"IF('RCA Chart Audit Worksheet'!AF5=\"Yes\",1,0)","v":0},{"$f":"IF('RCA Chart Audit Worksheet'!AG5=\"Yes\",1,0)","v":0},{"$f":"IF('RCA Chart Audit Worksheet'!AH5=\"Yes\",1,0)","v":0},{"$f":"IF('RCA Chart Audit Worksheet'!AI5=\"Yes\",1,0)","v":0},null,{"$f":"SUM(C3:G3)","v":0},{"$f":"SUM(H3:Q3)","v":1},{"$f":"SUM(R3:X3)","v":0},null,{"$f":"IF(SUM(Z3:AB3)=0,0,IF(Z3>=AA3,IF(Z3>=AB3,1,0),0))","v":0},{"$f":"IF(SUM(Z3:AB3)=0,0,IF(AA3>=Z3,IF(AA3>=AB3,1,0),0))","v":1},{"$f":"IF(SUM(Z3:AB3)=0,0,IF(AB3>=Z3,IF(AB3>=AA3,1,0),0))","v":0}]
[1,null,{"$f":"IF('RCA Chart Audit Worksheet'!N6=\"Yes\",1,0)","v":0},{"$f":"IF('RCA Chart Audit Worksheet'!O6=\"Yes\",1,0)","v":0},{"$f":"IF('RCA Chart Audit Worksheet'!P6=\"Yes\",1,0)","v":0},{"$f":"IF('RCA Chart Audit Worksheet'!Q6=\"Yes\",1,0)","v":0},{"$f":"IF('RCA Chart Audit Worksheet'!R6=\"Yes\",1,0)","v":0},{"$f":"IF('RCA Chart Audit Worksheet'!S6=\"Yes\",1,0)","v":0},{"$f":"IF('RCA Chart Audit Worksheet'!T6=\"Yes\",1,0)","v":0},{"$f":"IF('RCA Chart Audit Worksheet'!U6=\"Yes\",1,0)","v":0},{"$f":"IF('RCA Chart Audit Worksheet'!V6=\"Yes\",1,0)","v":0},{"$f":"IF('RCA Chart Audit Worksheet'!W6=\"Yes\",1,0)","v":0},{"$f":"IF('RCA Chart Audit Worksheet'!X6=\"Yes\",1,0)","v":0},{"$f":"IF('RCA Chart Audit Worksheet'!Y6=\"Yes\",1,0)","v":0},{"$f":"IF('RCA Chart Audit Worksheet'!Z6=\"Yes\",1,0)","v":0},{"$f":"IF('RCA Chart Audit Worksheet'!AA6=\"Yes\",1,0)","v":0},{"$f":"IF('RCA Chart Audit Worksheet'!AB6=\"Yes\",1,0)","v":0},{"$f":"IF('RCA Chart Audit Worksheet'!AC6=\"Yes\",1,0)","v":1},{"$f":"IF('RCA Chart Audit Worksheet'!AD6=\"Yes\",1,0)","v":0},{"$f":"IF('RCA Chart Audit Worksheet'!AE6=\"Yes\",1,0)","v":0},{"$f":"IF('RCA Chart Audit Worksheet'!AF6=\"Yes\",1,0)","v":0},{"$f":"IF('RCA Chart Audit Worksheet'!AG6=\"Yes\",1,0)","v":0},{"$f":"IF('RCA Chart Audit Worksheet'!AH6=\"Yes\",1,0)","v":0},{"$f":"IF('RCA Chart Audit Worksheet'!AI6=\"Yes\",1,0)","v":0},null,0,0,1,null,0,0,1]
[2,null,{"$f":"IF('RCA Chart Audit Worksheet'!N7=\"Yes\",1,0)","v":1},{"$f":"IF('RCA Chart Audit Worksheet'!O7=\"Yes\",1,0)","v":0},{"$f":"IF('RCA Chart Audit Worksheet'!P7=\"Yes\",1,0)","v":0},{"$f":"IF('RCA Chart Audit Worksheet'!Q7=\"Yes\",1,0)","v":0},{"$f":"IF('RCA Chart Audit Worksheet'!R7=\"Yes\",1,0)","v":0},{"$f":"IF('RCA Chart Audit Worksheet'!S7=\"Yes\",1,0)","v":1},{"$f":"IF('RCA Chart Audit Worksheet'!T7=\"Yes\",1,0)","v":0},{"$f":"IF('RCA Chart Audit Worksheet'!U7=\"Yes\",1,0)","v":0},{"$f":"IF('RCA Chart Audit Worksheet'!V7=\"Yes\",1,0)","v":0},{"$f":"IF('RCA Chart Audit Worksheet'!W7=\"Yes\",1,0)","v":0},{"$f":"IF('RCA Chart Audit Worksheet'!X7=\"Yes\",1,0)","v":0},{"$f":"IF('RCA Chart Audit Worksheet'!Y7=\"Yes\",1,0)","v":0},{"$f":"IF('RCA Chart Audit Worksheet'!Z7=\"Yes\",1,0)","v":0},{"$f":"IF('RCA Chart Audit Worksheet'!AA7=\"Yes\",1,0)","v":0},{"$f":"IF('RCA Chart Audit Worksheet'!AB7=\"Yes\",1,0)","v":0},{"$f":"IF('RCA Chart Audit Worksheet'!AC7=\"Yes\",1,0)","v":0},{"$f":"IF('RCA Chart Audit Worksheet'!AD7=\"Yes\",1,0)","v":0},{"$f":"IF('RCA Chart Audit Worksheet'!AE7=\"Yes\",1,0)","v":0},{"$f":"IF('RCA Chart Audit Worksheet'!AF7=\"Yes\",1,0)","v":0},{"$f":"IF('RCA Chart Audit Worksheet'!AG7=\"Yes\",1,0)","v":0},{"$f":"IF('RCA Chart Audit Worksheet'!AH7=\"Yes\",1,0)","v":0},{"$f":"IF('RCA Chart Audit Worksheet'!AI7=\"Yes\",1,0)","v":0},null,1,1,0,null,1,1,0]
[3,null,{"$f":"IF('RCA Chart Audit Worksheet'!N8=\"Yes\",1,0)","v":0},{"$f":"IF('RCA Chart Audit Worksheet'!O8=\"Yes\",1,0)","v":0},{"$f":"IF('RCA Chart Audit Worksheet'!P8=\"Yes\",1,0)","v":0},{"$f":"IF('RCA Chart Audit Worksheet'!Q8=\"Yes\",1,0)","v":0},{"$f":"IF('RCA Chart Audit Worksheet'!R8=\"Yes\",1,0)","v":0},{"$f":"IF('RCA Chart Audit Worksheet'!S8=\"Yes\",1,0)","v":0},{"$f":"IF('RCA Chart Audit Worksheet'!T8=\"Yes\",1,0)","v":0},{"$f":"IF('RCA Chart Audit Worksheet'!U8=\"Yes\",1,0)","v":0},{"$f":"IF('RCA Chart Audit Worksheet'!V8=\"Yes\",1,0)","v":0},{"$f":"IF('RCA Chart Audit Worksheet'!W8=\"Yes\",1,0)","v":0},{"$f":"IF('RCA Chart Audit Worksheet'!X8=\"Yes\",1,0)","v":0},{"$f":"IF('RCA Chart Audit Worksheet'!Y8=\"Yes\",1,0)","v":0},{"$f":"IF('RCA Chart Audit Worksheet'!Z8=\"Yes\",1,0)","v":0},{"$f":"IF('RCA Chart Audit Worksheet'!AA8=\"Yes\",1,0)","v":0},{"$f":"IF('RCA Chart Audit Worksheet'!AB8=\"Yes\",1,0)","v":0},{"$f":"IF('RCA Chart Audit Worksheet'!AC8=\"Yes\",1,0)","v":0},{"$f":"IF('RCA Chart Audit Worksheet'!AD8=\"Yes\",1,0)","v":0},{"$f":"IF('RCA Chart Audit Worksheet'!AE8=\"Yes\",1,0)","v":0},{"$f":"IF('RCA Chart Audit Worksheet'!AF8=\"Yes\",1,0)","v":0},{"$f":"IF('RCA Chart Audit Worksheet'!AG8=\"Yes\",1,0)","v":0},{"$f":"IF('RCA Chart Audit Worksheet'!AH8=\"Yes\",1,0)","v":0},{"$f":"IF('RCA Chart Audit Worksheet'!AI8=\"Yes\",1,0)","v":0},null,0,0,0,null,0,0,0]
[4,null,{"$f":"IF('RCA Chart Audit Worksheet'!N9=\"Yes\",1,0)","v":1},{"$f":"IF('RCA Chart Audit Worksheet'!O9=\"Yes\",1,0)","v":0},{"$f":"IF('RCA Chart Audit Worksheet'!P9=\"Yes\",1,0)","v":0},{"$f":"IF('RCA Chart Audit Worksheet'!Q9=\"Yes\",1,0)","v":0},{"$f":"IF('RCA Chart Audit Worksheet'!R9=\"Yes\",1,0)","v":0},{"$f":"IF('RCA Chart Audit Worksheet'!S9=\"Yes\",1,0)","v":0},{"$f":"IF('RCA Chart Audit Worksheet'!T9=\"Yes\",1,0)","v":0},{"$f":"IF('RCA Chart Audit Worksheet'!U9=\"Yes\",1,0)","v":0},{"$f":"IF('RCA Chart Audit Worksheet'!V9=\"Yes\",1,0)","v":0},{"$f":"IF('RCA Chart Audit Worksheet'!W9=\"Yes\",1,0)","v":0},{"$f":"IF('RCA Chart Audit Worksheet'!X9=\"Yes\",1,0)","v":0},{"$f":"IF('RCA Chart Audit Worksheet'!Y9=\"Yes\",1,0)","v":0},{"$f":"IF('RCA Chart Audit Worksheet'!Z9=\"Yes\",1,0)","v":0},{"$f":"IF('RCA Chart Audit Worksheet'!AA9=\"Yes\",1,0)","v":0},{"$f":"IF('RCA Chart Audit Worksheet'!AB9=\"Yes\",1,0)","v":0},{"$f":"IF('RCA Chart Audit Worksheet'!AC9=\"Yes\",1,0)","v":0},{"$f":"IF('RCA Chart Audit Worksheet'!AD9=\"Yes\",1,0)","v":0},{"$f":"IF('RCA Chart Audit Worksheet'!AE9=\"Yes\",1,0)","v":0},{"$f":"IF('RCA Chart Audit Worksheet'!AF9=\"Yes\",1,0)","v":0},{"$f":"IF('RCA Chart Audit Worksheet'!AG9=\"Yes\",1,0)","v":0},{"$f":"IF('RCA Chart Audit Worksheet'!AH9=\"Yes\",1,0)","v":0},{"$f":"IF('RCA Chart Audit Worksheet'!AI9=\"Yes\",1,0)","v":0},null,1,0,0,null,1,0,0]
[5,null,{"$f":"IF('RCA Chart Audit Worksheet'!N10=\"Yes\",1,0)","v":0},{"$f":"IF('RCA Chart Audit Worksheet'!O10=\"Yes\",1,0)","v":0},{"$f":"IF('RCA Chart Audit Worksheet'!P10=\"Yes\",1,0)","v":0},{"$f":"IF('RCA Chart Audit Worksheet'!Q10=\"Yes\",1,0)","v":0},{"$f":"IF('RCA Chart Audit Worksheet'!R10=\"Yes\",1,0)","v":0},{"$f":"IF('RCA Chart Audit Worksheet'!S10=\"Yes\",1,0)","v":0},{"$f":"IF('RCA Chart Audit Worksheet'!T10=\"Yes\",1,0)","v":0},{"$f":"IF('RCA Chart Audit Worksheet'!U10=\"Yes\",1,0)","v":0},{"$f":"IF('RCA Chart Audit Worksheet'!V10=\"Yes\",1,0)","v":0},{"$f":"IF('RCA Chart Audit Worksheet'!W10=\"Yes\",1,0)","v":0},{"$f":"IF('RCA Chart Audit Worksheet'!X10=\"Yes\",1,0)","v":0},{"$f":"IF('RCA Chart Audit Worksheet'!Y10=\"Yes\",1,0)","v":0},{"$f":"IF('RCA Chart Audit Worksheet'!Z10=\"Yes\",1,0)","v":0},{"$f":"IF('RCA Chart Audit Worksheet'!AA10=\"Yes\",1,0)","v":0},{"$f":"IF('RCA Chart Audit Worksheet'!AB10=\"Yes\",1,0)","v":0},{"$f":"IF('RCA Chart Audit Worksheet'!AC10=\"Yes\",1,0)","v":0},{"$f":"IF('RCA Chart Audit Worksheet'!AD10=\"Yes\",1,0)","v":0},{"$f":"IF('RCA Chart Audit Worksheet'!AE10=\"Yes\",1,0)","v":0},{"$f":"IF('RCA Chart Audit Worksheet'!AF10=\"Yes\",1,0)","v":0},{"$f":"IF('RCA Chart Audit Worksheet'!AG10=\"Yes\",1,0)","v":0},{"$f":"IF('RCA Chart Audit Worksheet'!AH10=\"Yes\",1,0)","v":0},{"$f":"IF('RCA Chart Audit Worksheet'!AI10=\"Yes\",1,0)","v":0},null,0,0,0,null,0,0,0]
{"$rows_left_out":46}
{"sheet":"Pivot Tables","index":3,"n_rows":9,"n_cols":8,"rows_kept":9,"cut":false,"hidden":true,"merged":[]}
[null,null,null,null,null,null,"Month of Review","(All)"]
[]
["Row Labels","Sum of Family issues","Sum of Agency based Issues","Sum of Referral information incomplete or inaccurate",null,null,"Row Labels","Count of Primary Reason for Readmission"]
["May",1,0,0,null,null,"Family issues",1]
["June",0,2,3,null,null,"Multiple Reasons",1]
["Grand Total",1,2,3,null,null,"No Reason",1]
[null,null,null,null,null,null,"Referral information incomplete or inaccurate",2]
[null,null,null,null,null,null,"Agency based Issues",1]
{"$rows_left_out":1}